"Accession Number","Amount To Be Raised","CIK Number","City","Company Name","Federel Exemptions/Exlcusions","Filing Date","Filing Type","Industry Group","Industry Group Code","Amendment","Principal Place of Business","Principal Place of Business Code","HTML Link","Revenue or Assets","State of Jurisdiction","State of Jurisdiction Code","Street 1","Street 2","Tier","Type of Security","Type of Security Description","Zip Code","Associated Auditor","Associated Auditor Fee","Associated Legal Service","Associated Legal Service Fee","Associated Promotor","Associated Promotor Fee","Associated Sales Commission","Associated Sales Commission Fee"
"0001746059-21-000592",,"0001894939","BRIMFIELD","MCC LLC",,"2021-12-07 14:50:02","C",,,,"MASSACHUSETTS","MA","https://disclosurequest-assets.s3.amazonaws.com/Archives/edgar/data/1894939/000174605921000592/xslC_X01/primary_doc.html",,,,"67 CHAMPEAUX RD",,,,,"01010","","","","","","","",""
"0001746059-21-000585",,"0001896717","SALEM","Speakeasy Donuts Sole Prop",,"2021-12-06 16:31:24","C",,,,"MASSACHUSETTS","MA","https://disclosurequest-assets.s3.amazonaws.com/Archives/edgar/data/1896717/000174605921000585/xslC_X01/primary_doc.html",,,,"4 1ST ST APT 8006",,,,,"01970","","","","","","","",""
"0001887215-21-000001",,"0001887215","BOSTON","1463 Dot Ave MM LLC",,"2021-12-03 14:30:27","C",,,,"MASSACHUSETTS","MA","https://disclosurequest-assets.s3.amazonaws.com/Archives/edgar/data/1887215/000188721521000001/xslC_X01/primary_doc.html",,,,"C/O TLEE DEVELOPMENT, LLC","1452 DORCHESTER AVE, 4TH FLOOR",,,,"02122","","","","","","","",""
"0001746059-21-000570",,"0001803385","DORCHESTER","TRISKELE VENTURES INC.",,"2021-11-26 12:04:20","C",,,,"MASSACHUSETTS","MA","https://disclosurequest-assets.s3.amazonaws.com/Archives/edgar/data/1803385/000174605921000570/xslC_X01/primary_doc.html",,,,"60A GIBSON STREET","UNIT 5",,,,"02122","","","","","","","",""
"0001746059-21-000563",,"0001894272","SOMERVILLE","Odyssey's LLC",,"2021-11-23 16:43:43","C",,,,"MASSACHUSETTS","MA","https://disclosurequest-assets.s3.amazonaws.com/Archives/edgar/data/1894272/000174605921000563/xslC_X01/primary_doc.html",,,,"11 EVERETT AVE",,,,,"02145","","","","","","","",""
"0001665160-21-002003",,"0001892473","Brookline","XRHealth, Inc.",,"2021-11-12 14:39:42","C",,,,"MASSACHUSETTS","MA","https://disclosurequest-assets.s3.amazonaws.com/Archives/edgar/data/1892473/000166516021002003/xslC_X01/primary_doc.html",,,,"1330 Beacon St STE 209",,,,,"02446","","","","","","","",""
"0001746059-21-000551",,"0001889805","BOSTON","Heritage Club LLC",,"2021-11-10 16:32:03","C",,,,"MASSACHUSETTS","MA","https://disclosurequest-assets.s3.amazonaws.com/Archives/edgar/data/1889805/000174605921000551/xslC_X01/primary_doc.html",,,,"46 ADAMS ST APT C1",,,,,"02122","","","","","","","",""
"0001746059-21-000548",,"0001891687","BOSTON","Lowkey LLC",,"2021-11-09 17:10:36","C",,,,"MASSACHUSETTS","MA","https://disclosurequest-assets.s3.amazonaws.com/Archives/edgar/data/1891687/000174605921000548/xslC_X01/primary_doc.html",,,,"1601 BLUE HILL AVE STE 201",,,,,"02126","","","","","","","",""